Вопросы с тегами [runtime-error]

1

голосов
1

ответ
224

Просмотры

Vba code getting error “select method of range class failed”

В приведенном ниже коде, я получаю сообщение об ошибке «Выберите метод Range класса Failed» на линии, указанной. Я пытаюсь скопировать некоторые фиксированные диапазоны от рабочего листа А Workbook XY в рабочий лист А всех открытых книг. Пожалуйста, помогите мне с вопросами. Кроме того, предлагают более или оптимизированный способ сделать то же самое. Заранее спасибо. Sub Macro1 () Dim WBS Как Workbooks Dim As Workbook Всемирный банк Dim ws11111 As Worksheet Set WBS = Application.Workbooks Для каждого ВБ в WBS Установите ws11111 = wb.Worksheets ( "A") '' ОШИБКА изломов на следующей строке: wb.Worksheets ( "А") Строки (.. "1: 1") Выберите '' ОШИБКА: "Выберите метод Range Class Failed" Selection.Insert сдвиг: = xlDown, CopyOrigin: = xlFormatFromLeftOrAbove Selection.Insert сдвига: = xlDown, CopyOrigin:
yashika vaish
1

голосов
0

ответ
69

Просмотры

VBA динамического поиска строки в то время цикла

Я новичок в VBA и, вероятно, следует потратить некоторое время на отладку и обучение формальности, как следует писать код. Я использую цикл, который использует функцию HLOOKUP для заполнения таблицы из одного листа на основе данных о мастер-листе. (Это в Суб SetMatrix). В Sub, который выполняет эту задачу, я использую некоторые другие ОДС, один из которых копирует и вставляет переменные (имена из 3-го листа, который может измениться) я хочу для поиска из главного листа. В любом случае, он работает прекрасно, когда я использую жёстко прописанный номер для строки в функции поиска. Однако, как только я пытаюсь использовать переменную (jpmRow вместо числа, как 50) для строки она будет работать только в первый раз. Затем, когда я запускаю его снова я получаю ошибки во время выполнения 91 - переменная объекта или переменная withblock не установлена. Отладчик взять меня обратно в динамическом диапазоне UDF, Установить StartCell линию, которая путает меня, потому что не там, где я устанавливаю переменные строки. В то же время, если я использую константу для строки это позволяет мне повторно ВТОРОСТЕПЕННОЕ с успехом каждый раз. Вот код: Option Explicit Dim wsTemplate Как Worksheet Dim WS Как Worksheet Dim TxtCell As Range Dim PortfolioCell As String Dim StartCell Как Range Dim EndCell Как Range Dim RangeParameter As Range Dim jpmRow As Integer Dim MyColumn As Integer Dim myRow As Integer Функция динамический диапазон ( TxtToFind As String) Как Диапазон Тусклое к As Integer к = iCount Набор Ws = Листы ( "Шаблон") Set StartCell = ws.Cells.Find (TxtToFind) .offset (2, 0) = MyColumn StartCell.Column myRow = StartCell.Row Установите EndCell = ws.Cells (myRow + к - 1, MyColumn) Установить динамический диапазон = ws.Range (StartCell.Address, EndCell.Address) '
aimceo2017
1

голосов
0

ответ
277

Просмотры

ошибка Java Runtime: java.lang.ClassFormatError: StackMapTable ошибка Формат: плохой тип размер массива

Мы компиляция и запуск в Java8. Полная ошибка: java.lang.ClassFormatError: StackMapTable ошибка Формат: плохой размер тип массива в методе com.internal.connection.ga (Ljava / языки / String; Ljava / Util / Карта; Z) Lcom / внутренний / подключение / модель / ExecuteAnonymousResponse; Java версия: $ Java -версия Java версия "1.8.0_162" Java (TM) SE Runtime Environment (строите 1.8.0_162-b12) Java HotSpot (TM) 64-разрядного сервера VM (сборка 25,162-b12, смешанный режим) Никогда видел эту ошибку и поиск в сети, не показывает много информации. Если это какой-либо полезной, я был установлен Java9, но после того, как получить эту ошибку удалил его, на всякий случай. Но все же ошибка. Я не чистится скомпилирован зависимостей в Java 8, чтобы быть уверенным, но все равно без толку.
singularity
1

голосов
0

ответ
741

Просмотры

Debug провал утверждение, «__acrt_first_block == заголовок» при использовании OpenCV для живой веб-камера? [Дубликат]

Этот вопрос уже есть ответ здесь: почему OpenCV imshow () создает новое окно имеет такое же имя, как namedWindow () делает в режиме отладки? 1 ответ Debug Assertion Failed! Выражение: __acrt_first_block == заголовок 3 ответа Я пытаюсь сделать распознавание пальца с помощью OpenCV, который работает правильно, когда просто обрабатывать одно изображения от захвата, однако после добавления времени цикла, чтобы он перейти от одного захвата изображения жить обработки , там, кажется, показывая ошибку кучи. Я в настоящее время работает его на Visual Studio 2017 Вт / OpenCV 3.41. Ошибка с ++ Runtime Library Microsoft Visual C является Debug Assertion Failed! Файл: minkernel \ CRTS \ ucrt \ SRC \ appcrt \ кучного \ debug_heap.cpp Линия: 996 Выражение: __acrt_first_block == заголовок Код, я использую это: #include "stdafx.h" #include "opencv2 / imgcodecs.hpp" #include "opencv2 / highgui.hpp" #include "opencv2 / imgproc.hpp" #include с использованием пространства имен резюме; используя патезрас; INT myMax (интермедиат а, б INT, INT с); INT myMin (интермедиат а, б INT, INT с); mySkinDetect недействительными (Мат & SRC, Мат & ДСТ); Mat ЦСИ; Mat src_gray; INT молотить = 100; INT max_thresh = 255; RNG RNG (12345); недействительный thresh_callback (интермедиат, недействительный *); INT основных () {VideoCapture колпачок (0); в то время как (1) {колпачок >> ЦСИ; Mat frameDest; frameDest = Mat :: нули (src.rows, src.cols, CV_8UC1); mySkinDetect (SRC, frameDest); INT erosion_size = 1; Мат элемент = getStructuringElement (MORPH_RECT, размер (2 * erosion_size + 1, 2 * erosion_size + 1), Точка (erosion_size, erosion_size)); подрывать (frameDest, frameDest, элемент); подрывать (frameDest, frameDest, элемент); namedWindow ( "Skin", WINDOW_AUTOSIZE); imshow ( "Skin", frameDest); размытие (frameDest, SRC, размер (3, 3)); createTrackbar ( "Порог:", "Источник", и молотить, max_thresh, thresh_callback); thresh_callback (0, 0); если (WaitKey (30) == 27) {перерыва; }} Возвращение (0); } Недействительным thresh_callback (INT, недействительным *) {Mat threshold_output; векторные контуры; вектор иерархии; Порог (SRC, threshold_output, молотить, 255, THRESH_BINARY); findContours (threshold_output, контуры, иерархия, RETR_TREE, CHAIN_APPROX_SIMPLE, точка (0, 0)); vectorhull (contours.size ()); вектор hullsI (contours.size ()); vectordefects (contours.size ()); INT индекс = 0; INT площадь = 0; для (INT I = 0; г <contours.size (); я ++) {двойной а = contourArea (контуры [I]); если (а> область) {площадь = а; Индекс = я; }} Для (INT I = 0; г <contours.size (); я ++) {ConvexHull (контуры [I], корпус [I], ложь); ConvexHull (контуры [I], hullsI [I], ложь); если (hullsI [I] .size ()> 3) {convexityDefects (контуры [I], hullsI [I], дефекты [I]); }} Мат рисунок = Mat :: нули (threshold_output.size (), CV_8UC3); для (size_t = 0; г <contours.size (); я ++) {Скалярного цвета = скаляр (rng.uniform (0, 255), rng.uniform (0, 255), rng.uniform (0, 255)) ; drawContours (рисунок, контуры, (INT) я, цвет, 1, 8, вектор (), 0, точка ()); drawContours (рисунок, корпус, (INT) я, цвет, 1, 8, вектор (), 0, точка ()); } ИНТ пальцы = 0; если (область> 50) {для (Int J = 0; J 5) // фильтр дефектов по глубине {INT = начать Защиту [0]; Точка ptStart (контуры [индекс] [пуск]); INT = конец четкости [1]; Точка ptEnd (контуры [индекс] [конец]); INT мин = Защита [2]; Точка ptFar (контуры [индекс] [мин]); линии (рисунок, ptStart, ptEnd, Скалярное (0, 255, 0), 1); линии (рисунок, ptStart, ptFar, Скалярное (0, 255, 0), 1); линии (рисунок, ptEnd, ptFar, Скалярное (0, 255, 0), 1); круг (рисунок, ptFar, 4, скаляр (0, 255, 0), 2); пальцы + = 1; }}} Станд :: строка s = станд :: to_string (пальцы-1); namedWindow ( "Халл демо", WINDOW_AUTOSIZE); putText (рисунок "Number Пальцы =" + S, пункт (drawing.cols / 1.5, drawing.rows / 10), FONT_HERSHEY_PLAIN, 1.2f, Скалярное (200, 0, 0), 2); imshow ( "Халл демо", рисунок); } INT myMax (интермедиат а, б INT, INT с) {INT т = а; (Недействительными) ((т <б) && (т = б)); (Недействительными) ((м <с) && (т = с)); вернуться м; } // Функция, которая возвращает минимальное из 3 целых чисел Int myMin (Int А, Int, Int б с) {INT т = а; (Недействительными) ((т> б) && (т = б)); (Недействительными) ((т> с) && (т = с)); вернуться м; } // Функция, которая определяет, принадлежит ли пиксель коже на основе RGB значений аннулируются mySkinDetect (Mat & ЦСИ Mat & ДСТ) {// Обзоры цвета кожи моделирования и обнаружения методов: // Вежневца, Владимир, Василий Сазонов, и Алла Андреева. «Обзор по методам обнаружения цвета кожи на основе пикселей.» Proc. GraphiCon. Том 3. 2003. // Kakumanu, Praveen, Sokratis Makrogiannis и Николаос Бурбакис. «Обзор моделирования и обнаружения методов кожи цвета.» Распознавание образов 40,3 (2007): 1106-1122. для (INT I = 0; г <src.rows; я ++) {для (Int J = 0; J <src.cols; j ++) {// Для каждого пикселя, вычислить среднюю интенсивность 3 цветовых канала Vec3b интенсивности = src.at (I, J); // Vec3b является вектором 3 Uchar (без знака символов) INT B = интенсивности [0]; G = INT Интенсивность [1]; INT R = интенсивность [2]; если ((R> 95 && G> 40 && B> 20) && (myMax (R, G, В) - myMin (R, G, В)> 15) && (абс (R - G)> 15) && ( R> G) && (R> В)) {dst.at (I, J) = 255; }}}}
rique98
1

голосов
0

ответ
164

Просмотры

-encoding UTF-8 Java ошибка компиляции

Я получаю сообщение об ошибке, когда я пытаюсь запустить мою программу Java, я никогда не сталкивался с этим раньше, и когда я искал в Интернете я не мог найти что-нибудь помощь. / USR / Библиотека / JVM / Java-8-ВС / бен / Javac -Кодирование UTF-8 -classpath ': *: / USR / доли / Java / *' Solution.java 1> compile.err 2> & 1 проект My Java код: общественный класс Encircular {статического String [] найти (String [] команда) {INT х = 0; INT у = 0; булево GoUp = ложь; для (INT I = 0; г <commands.length (); я ++) {переключатель (commands.charAt (я)) {случай 'G': если (GoUp) {у ++; } Еще {х ++; } перерыв; случай 'L': GoUp = истина; перерыв; Случай 'R': GoUp = ложь; перерыв; }} Если (х == 0 && у == 0) {возвращение "ДА"; } Вернуть «НЕТ»; } Государственной статической силы основных (String [] арг) {System.out.println (doesCircleExist ( "GLGLG")); System.out.println (doesCircleExist ( "GRGL")); }
Jackie
1

голосов
2

ответ
1.4k

Просмотры

Python SQLAlchemy: psycopg2.ProgrammingError relation already exists?

Я повторяемые попытался создать таблицу MYTABLENAME с SQLAlchemy в Python. Я удалил все таблицы с помощью моего клиента SQL Dbeaver, но я получаю сообщение об ошибке, что таблица существует такое, что Traceback (самый последний вызов последнего): Файл «/home/hhh/anaconda3/lib/python3.6/site-packages/sqlalchemy/ двигатель / base.py», строка 1182, в _execute_context контексте) Файл "/home/hhh/anaconda3/lib/python3.6/site-packages/sqlalchemy/engine/default.py", строка 470, в do_execute cursor.execute (заявление, параметры) psycopg2.ProgrammingError: отношение "ix_MYTABLENAME_index" уже существует sqlalchemy.exc.ProgrammingError: (psycopg2.ProgrammingError) отношение "ix_MYTABLENAME_index" уже существует [SQL: 'CREATE INDEX "ix_MYTABLENAME_index" ON "MYTABLENAME" (индекс)' ] Я преуспеть в создании таблиц и их вставках с уникальным именем, но во второй раз я получаю сообщение об ошибке, несмотря на удаление таблиц в Dbeaver. Небольшой пример из даты и времени даты импорта из SQLAlchemy импорта create_engine импорта NumPy как нп импорт панд как П.Д. четкости storePandasDF2PSQL (myDF_): результаты #Store как панды Dataframe к базе данных PostgreSQL. # # # Пример DF = pd.DataFrame (np.random.randn (8, 4), столбцы = [ 'A', 'B', 'C', 'D']) # DBNAME = date.today (). STRFTIME ( "% Y% м% d") + "_ ТАБЛИЦА" #engine = create_engine ( 'PostgreSQL: // HHH: ВАШ ПАРОЛЬ @ локальный: 1234 / HHH') # df.to_sql (DBNAME, двигатель) DF = myDF_ DBNAME = date.today () STRFTIME ( "% Y% м% d") + "_ Таблица" двигатель = create_engine ( 'PostgreSQL:. // HHH: ВАШ ПАРОЛЬ @ локальный: 1234 / HHH ') # ОШИБКА: NameError: название „таблица“ не определен # table.declarative_base.metadata.drop_all (двигатель) #Drop все таблицы #TODO: Этот шаг может привести к ошибкам, так как SQLAlchemy считает #TODO: стол еще существует, даже если удален df.to_sql (DbName, двигатель) Что такое правильный способ очистки бэкенда, такие как некоторый индекс висящего для того, чтобы воссоздать таблицу со свежими данными? Другими словами, как решить эту ошибку? двигатель) Что такое правильный способ очистки бэкенда, такие как некоторый индекс висящего для того, чтобы воссоздать таблицу со свежими данными? Другими словами, как решить эту ошибку? двигатель) Что такое правильный способ очистки бэкенда, такие как некоторый индекс висящего для того, чтобы воссоздать таблицу со свежими данными? Другими словами, как решить эту ошибку?
hhh
1

голосов
1

ответ
44

Просмотры

VBA ошибка во время выполнения приложения 1004 определены или объект, определенный ошибку

Что-то очень странное. В какой-то момент это работает, и вдруг теперь я получаю сообщение об ошибке. Вопрос фм и см, когда отладка включена, фм = Пустой и см = Пустые Поэтому TVal = Пустая ошибка происходит в строке 34: TVal = WorksheetFunction.Sum (ws.Range (ws.Cells (FM, 11), ws.Cells (см, 11))) Полный код: Private Sub TextBox6_Change () Dim WS Как Worksheet Dim С.Р., ноги, Л.Р., фм, см, TVal, SVAL, I, J As Long Dim Wo, гс As String Set WS = ThisWorkbook.Worksheets ( "Cost Analysis") 'WS = Рабочий лист стер = 5' стер = Начало строки Л.Р. = ws.Cells (Rows.Count, 1) .END (xlUp) .Row 'Л.Р. = Последняя строка горе = Трим (UserForm1.TextBox4.Value) 'Work Order ножка = TRIM (UserForm1.TextBox5.Value)' нога гс = Обрезка (UserForm1.ComboBox3.Value) '
Death Magnetic
1

голосов
1

ответ
192

Просмотры

Таблица используется в курсоре выберите перестраивается от времени компиляции для времени выполнения

Я получаю сбой вызова. [7691] SP_name: Таблица используется в курсоре выбрать перестраиваются из компиляции, чтобы во время выполнения. Я считаю его потому, что у меня есть цикл по датам в моей хранимой процедуре: Если min_mnth = «2017-08» группа 1 порядка на 1 ..... Интересный факт, что это такая процедура иногда работают, в основном, то у меня было меньше итераций цикла , Я нашел только эту релевантную информацию https://community.teradata.com/t5/Database/Error-7691-P1-Table-used-in-cursor-select-is-restructured-from/td-p/36691 Они предлагают SET SESSION DATEFORM = INTEGERDATE - та же ошибка. Что это ошибка о и как это исправить?
Rocketq
1

голосов
0

ответ
85

Просмотры

excel vba runtime error 9 subscript out of range

Пожалуйста помоги! Я следовал учебник о том, как сделать пароль WorkSheet моего документа защищена через журнал на странице. У меня возникли проблемы с Error Run Time на ** строки ниже. Листы (SheetNm) .Protect «123» Листы (SheetNm) .Visible = xlSheetVisible Конец Если мне удалось обойти это один раз, удалив затем повторно вставив пространства в передней части строки. Но я не знаю, почему это работает, и что успех разве повторение. Кто-нибудь знает, как решить эту ошибку, что я получаю? Sub CheckUser () Dim UserRow, SheetCol As Long Dim SheetNm As String С Лист1 .calculate If .Range ( "B9"). Value = Empty Тогда Debug.Print "Некорректное UserName" MsgBox "Пожалуйста, введите правильный Имя пользователя" Exit Sub End If Если .Range ( "B8"). Значение True Then Debug.
Will
1

голосов
1

ответ
122

Просмотры

Добавить карту Google в существующий проект имеет раздувать исключение

Я хочу, чтобы показать карту на деятельности в существующие приложения. Добавить фрагмент карты в мой XML и получить ключ API, но приложение ниже ошибки. Как я могу это исправить? Добавить карту XML и активность с правой кнопкой мыши по пакету деятельности и выберите Google Maps деятельности, но опять-таки не работает и имеет ошибку. мой XML: Моя деятельность: пакет com.co.KITIL; импорт android.os.Bundle; импорт android.support.annotation.Nullable; импорт android.support.v4.app.FragmentActivity; импорт com.google.android.gms.maps.GoogleMap; импорт com.google.android.gms.maps.OnMapReadyCallback; импорт com.google.android.gms.maps.SupportMapFragment; общественный класс MapActivity расширяет FragmentActivity реализует OnMapReadyCallback {SupportMapFragment MAPview; GoogleMap Googlemap; @Override защищены недействительный OnCreate (@Nullable Пачка savedInstanceState) {super.onCreate (savedInstanceState); setContentView (R.layout.activity_map); MapView = (SupportMapFragment) getSupportFragmentManager () findFragmentById (R.id.map). mapView.getMapAsync (это); } @Override общественного недействительными onMapReady (GoogleMap Googlemap) {}} AndroidManifest: google_maps_api.xml от debug.res.values; AI ----------------- BCI Ошибка: java.lang.RuntimeException: Не удается запустить активность ComponentInfo {com..KITIL / com..KITIL.MapsActivity}: android.view. InflateException: Binary XML файл строка # 0: Binary XML файл строка # 0: Ошибка при наполнении фрагмент класса в android.app.ActivityThread.performLaunchActivity (ActivityThread.java:2817) на вызванную следующие причины: android.view.InflateException: строка файла Binary XML # 0:
Fahim
1

голосов
2

ответ
168

Просмотры

Live ads from Admob is not showing

Yesterday I created an account on Admob and on my app the test ads working well but the live (real) ads not showing. When I added onFaildToLoad event it returns INTERNAL_ERROR. So is there any solutions? and is it important to upload the app on play store to get live ads? Here is my xml file: and this is my java code: package com.example.moamen.webbrowser; import android.content.Intent; import android.os.Bundle; import android.support.v7.app.AppCompatActivity; import android.view.View; import android.widget.Button; import android.widget.EditText; import android.widget.Toast; import com.google.android.gms.ads.AdListener; import com.google.android.gms.ads.MobileAds; import com.google.android.gms.ads.AdRequest; import com.google.android.gms.ads.AdView; import static com.google.android.gms.ads.AdRequest.ERROR_CODE_INTERNAL_ERROR; import static com.google.android.gms.ads.AdRequest.ERROR_CODE_INVALID_REQUEST; import static com.google.android.gms.ads.AdRequest.ERROR_CODE_NETWORK_ERROR; import static com.google.android.gms.ads.AdRequest.ERROR_CODE_NO_FILL; public class LoginActivity extends AppCompatActivity { Button mButton; EditText mEditText; private AdView mAdView; @Override protected void onCreate(Bundle savedInstanceState) { super.onCreate(savedInstanceState); setContentView(R.layout.activity_login); mAdView = findViewById(R.id.adView); AdRequest adRequest = new AdRequest.Builder().build(); try { mAdView.loadAd(adRequest); } catch (Exception e) { e.printStackTrace(); } mEditText = (EditText) findViewById(R.id.editText); mButton = (Button) findViewById(R.id.button); final String passA= "facebook"; final String passB = "moa"; // Sample AdMob app ID: ca-app-pub-3940256099942544~3347511713 MobileAds.initialize(this, "ca-app-pub-8140603259324677~4251010820"); mButton.setOnClickListener(new View.OnClickListener() { @Override public void onClick(View v) { String text = mEditText.getText().toString().trim(); if (text.equals(passA)){ Intent intent = new Intent(LoginActivity.this,MainActivity.class); intent.putExtra("website","https://www.facebook.com/"); startActivity(intent); }else if (text.equals(passB) ){ Intent intent = new Intent(LoginActivity.this,MainActivity.class); intent.putExtra("website","https://www.google.com/"); startActivity(intent); }else { Toast.makeText(LoginActivity.this, "Password is incorrect", Toast.LENGTH_SHORT).show(); } } }); mAdView.setAdListener(new AdListener(){ @Override public void onAdFailedToLoad(int errorCode) { // Code to be executed when an ad request fails. if (errorCode == ERROR_CODE_INTERNAL_ERROR){ Toast.makeText(LoginActivity.this,"ERROR_CODE_INTERNAL_ERROR",Toast.LENGTH_SHORT).show(); }else if (errorCode == ERROR_CODE_INVALID_REQUEST){ Toast.makeText(LoginActivity.this,"ERROR_CODE_INVALID_REQUEST",Toast.LENGTH_SHORT).show(); }else if (errorCode == ERROR_CODE_NETWORK_ERROR){ Toast.makeText(LoginActivity.this,"ERROR_CODE_NETWORK_ERROR",Toast.LENGTH_SHORT).show(); }else if (errorCode == ERROR_CODE_NO_FILL){ Toast.makeText(LoginActivity.this,"ERROR_CODE_NO_FILL",Toast.LENGTH_SHORT).show(); } } }); } } this is my gardle.build file: apply plugin: 'com.android.application' android { compileSdkVersion 28 defaultConfig { applicationId "com.example.drshimaa.webbrowser" minSdkVersion 19 targetSdkVersion 28 versionCode 1 versionName "1.0" testInstrumentationRunner "android.support.test.runner.AndroidJUnitRunner" } buildTypes { release { minifyEnabled false proguardFiles getDefaultProguardFile('proguard-android.txt'), 'proguard-rules.pro' } } } dependencies { implementation fileTree(dir: 'libs', include: ['*.jar']) //noinspection GradleCompatible implementation 'com.android.support:appcompat-v7:28.0.0-alpha1' implementation 'com.android.support.constraint:constraint-layout:1.1.3' implementation 'com.android.support:design:28.0.0-rc02' implementation 'com.google.android.gms:play-services-ads:15.0.0' testImplementation 'junit:junit:4.12' androidTestImplementation 'com.android.support.test:runner:1.0.2' androidTestImplementation 'com.android.support.test.espresso:espresso-core:3.0.2' } allprojects { repositories { jcenter() maven { url "https://maven.google.com" } } } the error test ads is working well
Moamen
1

голосов
0

ответ
45

Просмотры

Error: unsupported audio format while converting .wav to double[]

I'm trying to convert a file with a .wav extension to a double array but I am getting an error: 09-15 05:09:47.222 22358-22358/com.R1100.bluetooth D/R1100Err: unsupported audio format: '/storage/emulated/0/HeartSounds/a0002.wav' The file really is a .wav but I have no idea why this happens. Here is the method I used: public static double[] read(String filename) { byte[] data = readByte(filename); int n = data.length; double[] d = new double[n/2]; for (int i = 0; i < n/2; i++) { d[i] = ((short) (((data[2*i+1] & 0xFF)
R1100
1

голосов
1

ответ
32

Просмотры

Копирование данных из листов Множественные рабочей книги (имя содержит «SAP») в одном листе

Я хотел бы объединять данные из рабочих листов, где имя листа содержит «SAP». Я написал код, чтобы сделать это, но каждый раз, когда он работает, я получаю ошибку времени выполнения «438». Это только начало моего кода, но он не работает :( Private Sub MergeFiles () Dim WS Как Worksheet Dim XPATH As String = XPATH ActiveWorkbook.Path & "\" Имя файла = Dir (XPATH & "* .xlsx" ) Do While файла "" Workbooks.Open Имя файла: = XPATH и имя файла, ReadOnly: = True For Each WS в книгах (Имя файла) Если LCase (ws.Name) Как "SAP *" Then Sheets (WS) .Activate Range (» A2:. L85" ) Выберите Selection.Copy End If Next Ws (рабочие книги файл).
Bence Farkas
1

голосов
1

ответ
59

Просмотры

Что вызывает ошибку «неожиданная числовая константа» в `данных $ NA`?

Я использую пакет LINERR в R, и построил объект выживания, но я получаю сообщение об ошибке, что я не могу вскрыть смысл. Может кто-нибудь помочь мне понять, что это указывает на? Данные разделить данные выживаемости. Мой код Surv
Nicolas Smoll
1

голосов
0

ответ
218

Просмотры

Получение Chrome ошибки расширения: Не удается найти контекст с указанным идентификатором и ошибкой протокола инспектора

Я пытаюсь создать базовое расширение с помощью Хрома DEV-инструменты API. Я создал панель в окне разработчиков-инструментов и визуализации пользовательского интерфейса с использованием чистого HTML и ES6. Но когда я создал ту же страницу пользовательского интерфейса в React (с помощью создания реагирующего-приложение сборка) инструмент хрома DEV не делает пользовательский интерфейс и с учетом следующими ошибок. Не удается найти контекст с указанным идентификатором _evaluateGlobal @ shell.js: 5111 ошибка сервера Extension: ошибка протокола инспектор: Не удается найти контекст с указанным идентификатором makeStatus @ shell.js: 7823 Я попробовал еще раз, удалив все другие мета-теги & рабочие конфиги обслуживание от HTML, тем не менее, я получаю один и тот же вопрос (я в состоянии вынести эту страницу среагировать должным образом в окне браузера). EDIT: Я в состоянии оказать основную реакцию страницы в хромированном devtool панели с использованием ReactJS в чистом виде JavaScript (не JSX, благодаря Вавилонскому-РЕПЛУ). Только проблема приходит при использовании создания реагирующего-приложении сборки. Пожалуйста, смотрите ниже код, extension.js // Создать вкладку в DevTools области chrome.devtools.panels.create ( «Инструмент заголовок», «toast.png», «panel.html», функция (панель) {консоли. войти (панель);}); Panel.html (основной материал-UI реагировать приложение с помощью создают реагирующими-приложение) Полный журнал ошибок: shell.js: 3123 [Устаревшие] document.registerElement устарела и будет удалена в M73, примерно в марте 2019 г. Пожалуйста, используйте окно .customElements.define вместо этого. См https://www.chromestatus.com/features/4642138092470272 для более подробной информации. UI.registerCustomElement @ shell.js: 3123 shell.js: 3081 [Устаревшие] Element.createShadowRoot устарела и будет удалена в M73, вокруг марта 2019. Пожалуйста, используйте Element.attachShadow вместо этого. См https://www.chromestatus.com/features/4507242028072960 для более подробной информации. UI.createShadowRootWithCoreStyles @ shell.js: 3081 shell.js: 7924 Main._createAppUI: 24.008056640625ms shell.js: 7924 Main._showAppUI: 72.796875ms shell.js: 7924 Main._initializeTarget: 9.6240234375ms shell.js: 7924 Main._lateInitialization : 18.457275390625ms devtools.js: 4 shell.js Объект: 5111 не удается найти контекст с указанным идентификатором _evaluateGlobal @ shell.js: 5111 shell.js: ошибка сервера 7823 Extension: ошибка протокола инспектор: не удается найти контекст с указанным идентификатором makeStatus @ оболочки. JS: 7823 Пожалуйста, поделитесь своими мыслями, комментарии и ссылки. Заранее спасибо. createShadowRootWithCoreStyles @ shell.js: 3081 shell.js: 7924 Main._createAppUI: 24.008056640625ms shell.js: 7924 Main._showAppUI: 72.796875ms shell.js: 7924 Main._initializeTarget: 9.6240234375ms shell.js: 7924 Main._lateInitialization: 18.457275390625 мс devtools.js: 4 shell.js Объект: 5111 не удается найти контекст с указанным идентификатором _evaluateGlobal @ shell.js: 5111 shell.js: ошибка сервера 7823 Extension: ошибка протокола инспектор: не удается найти контекст с указанным идентификатором makeStatus @ shell.js: 7823 Пожалуйста, поделитесь своими мыслями, комментарии и ссылки. Заранее спасибо. createShadowRootWithCoreStyles @ shell.js: 3081 shell.js: 7924 Main._createAppUI: 24.008056640625ms shell.js: 7924 Main._showAppUI: 72.796875ms shell.js: 7924 Main._initializeTarget: 9.6240234375ms shell.js: 7924 Main._lateInitialization: 18.457275390625 мс devtools.js: 4 shell.js Объект: 5111 не удается найти контекст с указанным идентификатором _evaluateGlobal @ shell.js: 5111 shell.js: ошибка сервера 7823 Extension: ошибка протокола инспектор: не удается найти контекст с указанным идентификатором makeStatus @ shell.js: 7823 Пожалуйста, поделитесь своими мыслями, комментарии и ссылки. Заранее спасибо. 5111 Не удается найти контекст с указанным идентификатором _evaluateGlobal @ shell.js: 5111 shell.js: Ошибка сервера 7823 Extension: ошибка протокола инспектор: Не удается найти контекст с указанным идентификатором makeStatus @ shell.js: 7823 Пожалуйста, поделитесь своими мыслями, комментарии и ссылки. Заранее спасибо. 5111 Не удается найти контекст с указанным идентификатором _evaluateGlobal @ shell.js: 5111 shell.js: Ошибка сервера 7823 Extension: ошибка протокола инспектор: Не удается найти контекст с указанным идентификатором makeStatus @ shell.js: 7823 Пожалуйста, поделитесь своими мыслями, комментарии и ссылки. Заранее спасибо.
Nithin CV
1

голосов
1

ответ
51

Просмотры

Run Time Error 429 Unresolved while Creating Pivot Table

Не могли бы вы помочь мне с ниже коды он бросками время выполнения ошибки 429 Компонент ActiveX не может создать объект на Выделенная часть Dim myFirstRow As Long Dim myLastRow As Long Dim myFirstColumn As Long Dim myLastColumn As Long Dim mySourceData As String Dim myDestinationRange As String Dim mySourceWorksheet Как Worksheet Dim myDestinationWorksheet Как Worksheet Dim myPivotTable Как PivotTable ** С ThisWorkbook ** Установите mySourceWorksheet = .Worksheets ( "WAM_RAW_DATA") Set myDestinationWorksheet = .Worksheets.Add End With myDestinationRange = myDestinationWorksheet.Range ( "A5"). Адрес (ReferenceStyle : = xlR1C1) myFirstRow = 1 myLastRow = 2020 myFirstColumn = 1 myLastColumn = 40 С mySourceWorksheet.Cells mySourceData =.Range (.Cells (myFirstRow, myFirstColumn), .Cells (myLastRow, myLastColumn)) Адрес. (ReferenceStyle: = xlR1C1) End With Set myPivotTable = ThisWorkbook.PivotCaches.Create (SourceType: = xlDatabase, SourceData: = mySourceWorksheet.Name & " !»& ​​mySourceData) .CreatePivotTable (TableDestination: = myDestinationWorksheet.Name & "" & myDestinationRange, TableName: = "! PivotTableNewSheet") С myPivotTable .PivotFields ( "Агент Имя") Ориентация = xlRowField .Position = 1 End С С myPivotTable. .PivotFields ( "Войти Дата"). Ориентация = xlColumnField .Position = 1 End With С myPivotTable .PivotFields ( "Войти Time"). Ориентация = xlDataField .Position = 1 .function = xlMin.NumberFormat = "ч: мм: сс" End With End Sub
Sachin
1

голосов
1

ответ
204

Просмотры

Python protobuf “from google.protobuf.pyext import _message” - “ImportError: DLL load failed: The specified procedure could not be found”

Я пытаюсь получить простой сценарий Python до преобразования Protobuf файлов в формате JSON файлов (требуемый формат для того, что я делаю на работе). Я видел некоторые рекомендации перейти на Python 3.6.1 (я на 3.6.0), вверх / понижения google.protobuf. Ни одно из решений помогло. Защиту convert_to_json (каталог: ул): os.chdir (jsonPath) для (корневые, директорий, файлов) в os.walk (os.getcwd ()): для file_ в файлах: если os.path.dirname (file_) = ( "рь ") корень и file_.endswith: json_file: ул = MessageToJson (file_) имя_файла = (os.path.dirname (файл _) раскол ( '\\') [- 1].) +" .json" file_path = os.join (jsonPath, имя_файла) с открытым (FILE_PATH, «ш»), как new_file: new_file.write (json_file) Я ожидал, чтобы это просто запустить и преобразовать убивание. РЬ файлы (Google шрифты) в .json файлы, чтобы иметь возможность классифицировать эти шрифты в моей программе. Что случилось, что я получил следующее сообщение об ошибке: Traceback (самый последний вызов последнего): Файл «[путь к pythonfile] .py», строка 5, в от protobuf.json_format импорта MessageToJson Файл «C: \ Python \ Lib \ сайт- пакеты \ Google \ Protobuf \ json_format.py», строка 63, в с google.protobuf импорта дескриптора файла "[pathToVenv] \ venv \ Lib \ сайт-пакеты \ Google \ Protobuf \ descriptor.py", строка 47, в от Google .protobuf.pyext импорта _message ImportError: DLL загрузка не удалась: Указанная процедура не может быть найдена. На первый взгляд - Дух, у меня нет «_message» в моем google.protobuf.pyext пакете, но я пробовал различные версии google.protobuf все нажитое от ПУМ. Пип был просто отлично установки любого другого пакета у меня есть, так что, скорее всего, не проблема с пипом. Существует, однако, файл с именем «cpp_message.py» в том же пакете, так что я не знаю, куда идти отсюда.
GrowingCode247
1

голосов
0

ответ
83

Просмотры

Swift 4 non-exhaustive switch compiles

Это мое понимание того, что в стриже, переключатель заявление, которое не является исчерпывающим и не имеет дела не по умолчанию не должен компилировать. Я планировал использовать это в свою пользу, так как у меня есть перечисление со многими случаями, и мне нравится иметь компилятор направить меня на каждое утверждение переключателя, который должен обновляться при добавлении случая. перечисление Скалярного {случай необработанный случай обрабатывается непрямой случай третьего (Vector2) непрямой случай четвертые (Vector2, Vector2)} перечисление Vector2 {случай обрабатывается (Скалярным, Скалярный) косвенный случай необработанных (Скалярный, Vector2)} расширение Скалярного {FUNC Eval () -> Int {переключатель собственной {случай .handled: возвращение 1 случай .third: возвращение 2}}} расширение Vector2 {функ Eval () -> (Int, Int) {переключатель собственной {случай .handled: возвращение (3,6)}} } пусть G = Scalar.handled печать (г. Eval ()) пусть Н = Scalar.unhandled печать (h.eval ()) Как оказалось, однако, в то время как большинство операторов коммутатора не компилировать, когда они не являются исчерпывающими, при переходе на мое перечисление, не исчерпывающие коммутаторы будут компиляции, даже не поднимая предупреждение. Во время выполнения, если переключатель ударил с перечислением, не обрабатывается одним из своих случаев, выбрасывается ошибка во время выполнения. Тема 1: Фатальная ошибка: неожиданное перечисление случае при переключении на значение типа «Скалярные» Я использую OSX 10.14.2, Xcode 10.1, Swift 4.2 Я смущен, потому что я не смог найти какую-либо информацию об этом вид переключателя заявление будет разрешено в скор. Как я могу сделать мой компилятор предупредить меня, когда он встречает неисчерпывающее заявление переключателя? в то время как большинство операторов коммутатора не компилировать, когда они не являются исчерпывающими, при переходе на мое перечисление, не исчерпывающие выключатели компилируются, даже не поднимая предупреждение. Во время выполнения, если переключатель ударил с перечислением, не обрабатывается одним из своих случаев, выбрасывается ошибка во время выполнения. Тема 1: Фатальная ошибка: неожиданное перечисление случае при переключении на значение типа «Скалярные» Я использую OSX 10.14.2, Xcode 10.1, Swift 4.2 Я смущен, потому что я не смог найти какую-либо информацию об этом вид переключателя заявление будет разрешено в скор. Как я могу сделать мой компилятор предупредить меня, когда он встречает неисчерпывающее заявление переключателя? в то время как большинство операторов коммутатора не компилировать, когда они не являются исчерпывающими, при переходе на мое перечисление, не исчерпывающие выключатели компилируются, даже не поднимая предупреждение. Во время выполнения, если переключатель ударил с перечислением, не обрабатывается одним из своих случаев, выбрасывается ошибка во время выполнения. Тема 1: Фатальная ошибка: неожиданное перечисление случае при переключении на значение типа «Скалярные» Я использую OSX 10.14.2, Xcode 10.1, Swift 4.2 Я смущен, потому что я не смог найти какую-либо информацию об этом вид переключателя заявление будет разрешено в скор. Как я могу сделать мой компилятор предупредить меня, когда он встречает неисчерпывающее заявление переключателя? ошибка во время выполнения выбрасывается. Тема 1: Фатальная ошибка: неожиданное перечисление случае при переключении на значение типа «Скалярные» Я использую OSX 10.14.2, Xcode 10.1, Swift 4.2 Я смущен, потому что я не смог найти какую-либо информацию об этом вид переключателя заявление будет разрешено в скор. Как я могу сделать мой компилятор предупредить меня, когда он встречает неисчерпывающее заявление переключателя? ошибка во время выполнения выбрасывается. Тема 1: Фатальная ошибка: неожиданное перечисление случае при переключении на значение типа «Скалярные» Я использую OSX 10.14.2, Xcode 10.1, Swift 4.2 Я смущен, потому что я не смог найти какую-либо информацию об этом вид переключателя заявление будет разрешено в скор. Как я могу сделать мой компилятор предупредить меня, когда он встречает неисчерпывающее заявление переключателя?
legalian
1

голосов
0

ответ
64

Просмотры

Why openCV cv2.LUT() throws assertion if both Source image and LUT seems to be compatible?

Я испытываю некоторые проблемы, чтобы иметь возможность применить LUT к изображениям с использованием OpenCV (4.0.0) в Python 3.6.5 Начиная с LUT (смотрите таблицу) из 256 элементов, как указано в документации, и пытается применить его к а «одна строка исходного изображения» (так как более сложные образы давали мне вопросы, а), всегда приводит к ошибке утверждение относительно каналов, не совместимый, не будучи непрерывным, или не является правильным типом данных (8 бит). Но все кажется правильным при печати векторов информации, размеров и каналов, типа данных, и я думаю (но я не знаю, как проверить в питоне) непрерывность быть тоже хорошо. Любая идея, почему я не могу применить LUT? Я создал пользовательскую функцию для печати массивы информации 'print_2Darray_Info () для того, чтобы проверить форму, тип данных, средний и значения Max / Min.
DoJeey
1

голосов
0

ответ
14

Просмотры

Pythonwin.exe does not indicate the line of code for runtime errors

Это сложная проблема, потому что она имеет дело с самим пользовательским интерфейсом Pythonwin.exe, а не мой код. Когда я запускаю файл со следующим кодом в нем, я бы ожидать, что если это ошибка, было бы показать линию, что не удалось на в выводе отладочного я буквально создать незапятнанную 32-битную питон 3.5 среды, установленную pywin32 и открыл testfile.py, чтобы запустить его и здесь были результаты. Скриншот Если вы видите строку: файл «C: \ testfile.py», строка 2, в Foo = 2 # Эта строка работает отлично, но идентифицируется как отладочные линии я бы ожидал, что это указывает на линии 5, а не линия 2. Внутри большего сценария, это гораздо более проблематично, так как мне нужно угадать, какая линия вызвала ошибку на основе контекста. Для того, чтобы повторить мою ситуацию в среде анаконды на основе: 1. Открыть Запрашивать Anaconda Command 2. выполните следующие строки для создания нашей среды установить CONDA_FORCE_32BIT = 1 Конда создать -n тест питона = 3,5 активировать тест Конда установить Сохранить файл -y pywin32 «testfile.py» с текстом: #comment Foo = 2 # Эта строка работает отлично, но идентифицирована как отладочные линии а = 2 а = 3 A = B # Эта строка вызывает ошибку, но не отождествляется Open PythonWin.exe, откройте файл «testfile.py» и нажмите F5 или выберите пункт Выполнить и это не просто проблема в анаконды установлены среды. Если у кого есть какие-либо представление о том, как сделать это сообщить плохую строку кода, или почему он действует таким образом, пожалуйста, дайте мне знать. Спасибо! но определяется как отладочные линии а = 2 а = 3 A = B # Эта строка вызывает ошибку, но не отождествляется Open PythonWin.exe, откройте файл «testfile.py» и нажмите F5 или выберите команду Выполнить и это не только проблема в анаконды установлена ​​средах. Если у кого есть какие-либо представление о том, как сделать это сообщить плохую строку кода, или почему он действует таким образом, пожалуйста, дайте мне знать. Спасибо! но определяется как отладочные линии а = 2 а = 3 A = B # Эта строка вызывает ошибку, но не отождествляется Open PythonWin.exe, откройте файл «testfile.py» и нажмите F5 или выберите команду Выполнить и это не только проблема в анаконды установлена ​​средах. Если у кого есть какие-либо представление о том, как сделать это сообщить плохую строку кода, или почему он действует таким образом, пожалуйста, дайте мне знать. Спасибо!
user2683482
1

голосов
0

ответ
24

Просмотры

cannot import name path error with %pylab inline?

two months ago i have installed anaconda and i'm using Jupyter lab. Everything ok until few days ago i have found this error cannot import name '_path' when I was trying to run thir row: %pylab inline Until few day ago this thing doesn't gave me an error. Do you know why and how i can fix this? THe complete error is: ImportError Traceback (most recent call last) in ----> 1 get_ipython().run_line_magic('pylab', 'inline') ~\Anaconda3\lib\site-packages\IPython\core\interactiveshell.py in run_line_magic(self, magic_name, line, _stack_depth) 2305 kwargs['local_ns'] = sys._getframe(stack_depth).f_locals 2306 with self.builtin_trap: -> 2307 result = fn(*args, **kwargs) 2308 return result 2309 in pylab(self, line) ~\Anaconda3\lib\site-packages\IPython\core\magic.py in (f, *a, **k) 185 # but it's overkill for just that one bit of state. 186 def magic_deco(arg): --> 187 call = lambda f, *a, **k: f(*a, **k) 188 189 if callable(arg): ~\Anaconda3\lib\site-packages\IPython\core\magics\pylab.py in pylab(self, line) 153 import_all = not args.no_import_all 154 --> 155 gui, backend, clobbered = self.shell.enable_pylab(args.gui, import_all=import_all) 156 self._show_matplotlib_backend(args.gui, backend) 157 print ("Populating the interactive namespace from numpy and matplotlib") ~\Anaconda3\lib\site-packages\IPython\core\interactiveshell.py in enable_pylab(self, gui, import_all, welcome_message) 3416 from IPython.core.pylabtools import import_pylab 3417 -> 3418 gui, backend = self.enable_matplotlib(gui) 3419 3420 # We want to prevent the loading of pylab to pollute the user's ~\Anaconda3\lib\site-packages\IPython\core\interactiveshell.py in enable_matplotlib(self, gui) 3377 gui, backend = pt.find_gui_and_backend(self.pylab_gui_select) 3378 -> 3379 pt.activate_matplotlib(backend) 3380 pt.configure_inline_support(self, backend) 3381 ~\Anaconda3\lib\site-packages\IPython\core\pylabtools.py in activate_matplotlib(backend) 311 matplotlib.rcParams['backend'] = backend 312 --> 313 import matplotlib.pyplot 314 matplotlib.pyplot.switch_backend(backend) 315 ~\Anaconda3\lib\site-packages\matplotlib\pyplot.py in 29 from cycler import cycler 30 import matplotlib ---> 31 import matplotlib.colorbar 32 from matplotlib import style 33 from matplotlib import _pylab_helpers, interactive ~\Anaconda3\lib\site-packages\matplotlib\colorbar.py in 30 31 import matplotlib as mpl ---> 32 import matplotlib.artist as martist 33 import matplotlib.cbook as cbook 34 import matplotlib.collections as collections ~\Anaconda3\lib\site-packages\matplotlib\artist.py in 14 import matplotlib 15 from . import cbook, docstring, rcParams ---> 16 from .path import Path 17 from .transforms import (Bbox, IdentityTransform, Transform, TransformedBbox, 18 TransformedPatchPath, TransformedPath) ~\Anaconda3\lib\site-packages\matplotlib\path.py in 19 import numpy as np 20 ---> 21 from . import _path, rcParams 22 from .cbook import (_to_unmasked_float_array, simple_linear_interpolation, 23 maxdict) ImportError: cannot import name '_path'
MementoMori
1

голосов
1

ответ
105

Просмотры

Как я могу отладить причину кода 0xc0000417 выхода

Я получаю код ошибки выхода 0xc0000417 (что переводится STATUS_INVALID_CRUNTIME_PARAMETER) в моем исполняемым (смешанный Fortran / C) и попытаться выяснить, что вызывает его. Это, кажется, происходит при попытке записи в файл, который я заключаю, что файл создан, но нет ничего в нем. Тем не менее, у меня есть подозрение, что это не / реальный / причина. Когда я отключить запись этого файла, который делается из кода C, он выходит из строя при написании другого файла, на этот раз из Fortran кода. Беда в том: это происходит только после того, как программы (тяжелый расчет CPU) закончил после запуска в течение ~ 2-3 дней. Когда я попытался сократить время вычислений с помощью различных средств, чтобы облегчить отладку, проблема не происходит больше. Казалось, как долго среда имеет решающее значение для запуска задачи. Я попытался запустить его в Visual Studio 2015, но VS не ломается / стоп (как это было бы, если, например, что произошло выдаёт ошибку сегментации), несмотря превратившись на разрыв во всех C ++ исключений, как было предложено в другом потоке и всех исключений Common Language Runtime , То, что я хотел бы VS сделать это либо разорвать всякий раз, когда код ошибки «производится» и проверьте значения переменных или, по крайней мере, получить трассировку стека. Я искал интенсивно, но я не мог найти удовлетворительное решение моей проблемы. По сути, мой вопрос похож на то, как отлаживать «Invalid параметра, переданные функции выполнения C»? но проблема не возникает с версией Linux моей программы, так что я ищу указание, как отлаживать его на Windows, либо с Visual Studio или каким-либо другим инструментом. Изменить: К сожалению, Я не смог найти удобный способ взлома автоматически, когда происходит ошибка. Так что я пошел с ручным способом установки точки останова (в VS) вблизи предполагаемой аварии и шаг за шагом, с помощью кода. Оказалось, что я получил указатель NULL из FOPEN: Myfile = FOPEN ( "somedir \\ somefile.xml"); несмотря на файл создается. Но при попытке записать в этот файл (с помощью ручки NULL!), Произошло выдаёт ошибку сегментации. Как ни странно, мне кажется, я только получить указатель NULL из Еорепа, когда процесс имеет длительный срок службы. Но это оффтоп для этого вопроса. Редактирование 2: Проверка глобальной переменной Errno дал код 22 ошибки, который снова переводит на недопустимый аргумент. Однако аргумент FOPEN не недействителен, как я проверил с помощью отладчика, и тот факт, что файл на самом деле создается правильно (с длиной 0 байт). Теперь я думаю, что этот код ошибки 22 просто вводит в заблуждение, потому что, когда я проверяю (через часы в VS) $ эээ, час я получаю: 0x000005aa ERROR_NO_SYSTEM_RESOURCES: Недостаточно системных ресурсов для завершения операции. Так же, как и упоминавшиеся здесь, у меня есть много места на жестком диске (1,4 Гб), большим количеством свободной оперативной памяти (3,2 Гб), и я боюсь, что что-то не напрямую вызвано моей программы, но что-то из-за сломанной ОС Windows дизайн обработки файла (он делает не бывает под Linux). Редактирование 3: Хорошо, кажется, что это не сама Windows, что это преступник, а компилятор Intel Fortran я использую. Каждый раз, когда я делаю отформатированных заявления на запись в моей программе, мутантная (Windows говорить мьютекс) ручка просочился. ! Использование WinDbg и htrace -enable, затем запустить немного дальше, ломаются и выдавать htrace -diff дает нагрузку этих цепочек вызовов: 0x00000000777ca25a: Ntdll NtCreateMutant + 0x000000000000000a 0x000007fefd54a1b7: KERNELBASE CreateMutexExW + 0x0000000000000057 0x000007fefd551d60:! KERNELBASE CreateMutexExA + 0x0000000000000050 0x000007fedfab24db: libifcoremd for_lge_ssll + 0x0000000000001dcb 0x000007fedfb03ed6: libifcoremd for_write_int_fmt + 0x0000000000000056 0x000000014085aa21: MyProg MY_ROUTINE + 0x0000000000000121 Во время выполнения программы эти мутантные ручки кажутся накапливаться, пока они не исчерпывают все ручки ресурсов (16711680 ручки), так что нет ничего не осталось для дескрипторов файлов. Редактирование 4: Это ошибка в Intel Фортран библиотеки времени выполнения, которые были исправлены с более поздней версией (смотрите здесь). Использование исправленной версии libifcoremd.dll исправляет проблему, то есть отсчет ручки не увеличивается больше во время отформатированных записей. NtCreateMutant + 0x000000000000000a 0x000007fefd54a1b7: KERNELBASE CreateMutexExW + 0x0000000000000057 0x000007fefd551d60: не KERNELBASE CreateMutexExA + 0x0000000000000050 0x000007fedfab24db: libifcoremd for_lge_ssll + 0x0000000000001dcb 0x000007fedfb03ed6: libifcoremd for_write_int_fmt + 0x0000000000000056 0x000000014085aa21: MyProg MY_ROUTINE + 0x0000000000000121 Во время выполнения программы эти мутантные ручки, кажется, накапливаются до тех пор, исчерпывают все ручки ресурсов (16711680 ручки), так что нет ничего не осталось для дескрипторов файлов. Редактирование 4: Это ошибка в Intel Фортран библиотеки времени выполнения, которые были исправлены с более поздней версией (смотрите здесь). Использование исправленной версии libifcoremd.dll исправляет проблему, то есть отсчет ручки не увеличивается больше во время отформатированных записей. NtCreateMutant + 0x000000000000000a 0x000007fefd54a1b7: KERNELBASE CreateMutexExW + 0x0000000000000057 0x000007fefd551d60: не KERNELBASE CreateMutexExA + 0x0000000000000050 0x000007fedfab24db: libifcoremd for_lge_ssll + 0x0000000000001dcb 0x000007fedfb03ed6: libifcoremd for_write_int_fmt + 0x0000000000000056 0x000000014085aa21: MyProg MY_ROUTINE + 0x0000000000000121 Во время выполнения программы эти мутантные ручки, кажется, накапливаются до тех пор, исчерпывают все ручки ресурсов (16711680 ручки), так что нет ничего не осталось для дескрипторов файлов. Редактирование 4: Это ошибка в Intel Фортран библиотеки времени выполнения, которые были исправлены с более поздней версией (смотрите здесь). Использование исправленной версии libifcoremd.dll исправляет проблему, то есть отсчет ручки не увеличивается больше во время отформатированных записей. CreateMutexExW + 0x0000000000000057 0x000007fefd551d60: KERNELBASE CreateMutexExA + 0x0000000000000050 0x000007fedfab24db: libifcoremd for_lge_ssll + 0x0000000000001dcb 0x000007fedfb03ed6:! Libifcoremd for_write_int_fmt + 0x0000000000000056 0x000000014085aa21: MyProg MY_ROUTINE + 0x0000000000000121 Во время выполнения программы эти мутантные ручки, кажется, накапливаются, пока они не исчерпывают все ручки ресурсов (16711680 ручки ), так что ничего не осталось для дескрипторов файлов. Редактирование 4: Это ошибка в Intel Фортран библиотеки времени выполнения, которые были исправлены с более поздней версией (смотрите здесь). Использование исправленной версии libifcoremd.dll исправляет проблему, то есть отсчет ручки не увеличивается больше во время отформатированных записей. CreateMutexExW + 0x0000000000000057 0x000007fefd551d60: KERNELBASE CreateMutexExA + 0x0000000000000050 0x000007fedfab24db: libifcoremd for_lge_ssll + 0x0000000000001dcb 0x000007fedfb03ed6:! Libifcoremd for_write_int_fmt + 0x0000000000000056 0x000000014085aa21: MyProg MY_ROUTINE + 0x0000000000000121 Во время выполнения программы эти мутантные ручки, кажется, накапливаются, пока они не исчерпывают все ручки ресурсов (16711680 ручки ), так что ничего не осталось для дескрипторов файлов. Редактирование 4: Это ошибка в Intel Фортран библиотеки времени выполнения, которые были исправлены с более поздней версией (смотрите здесь). Использование исправленной версии libifcoremd.dll исправляет проблему, то есть отсчет ручки не увеличивается больше во время отформатированных записей. libifcoremd for_write_int_fmt + 0x0000000000000056 0x000000014085aa21:! MyProg MY_ROUTINE + 0x0000000000000121 Во время выполнения программы эти мутантные ручки, кажется, накапливаются, пока они не исчерпывают все ручки ресурсов (16711680 ручки), так что нет ничего не осталось для дескрипторов файлов. Редактирование 4: Это ошибка в Intel Фортран библиотеки времени выполнения, которые были исправлены с более поздней версией (смотрите здесь). Использование исправленной версии libifcoremd.dll исправляет проблему, то есть отсчет ручки не увеличивается больше во время отформатированных записей. libifcoremd for_write_int_fmt + 0x0000000000000056 0x000000014085aa21:! MyProg MY_ROUTINE + 0x0000000000000121 Во время выполнения программы эти мутантные ручки, кажется, накапливаются, пока они не исчерпывают все ручки ресурсов (16711680 ручки), так что нет ничего не осталось для дескрипторов файлов. Редактирование 4: Это ошибка в Intel Фортран библиотеки времени выполнения, которые были исправлены с более поздней версией (смотрите здесь). Использование исправленной версии libifcoremd.dll исправляет проблему, то есть отсчет ручки не увеличивается больше во время отформатированных записей. са ошибка в Intel Фортран библиотеки времени выполнения, которые были исправлены с более поздней версией (смотрите здесь). Использование исправленной версии libifcoremd.dll исправляет проблему, то есть отсчет ручки не увеличивается больше во время отформатированных записей. са ошибка в Intel Фортран библиотеки времени выполнения, которые были исправлены с более поздней версией (смотрите здесь). Использование исправленной версии libifcoremd.dll исправляет проблему, то есть отсчет ручки не увеличивается больше во время отформатированных записей.
lineinthesand
0

голосов
2

ответ
36

Просмотры

ошибка сегментирования во время выполнения консольного кода в C ++

Я пытаюсь сделать простую консоль студента деталь отображения системы, в которой есть 2 классов, класс ученик (Базовый класс) с переменными-членами для имени и регистрационного номера и класс studentAthlete (производный класс) со спортивным строковым типом. Код компилируется успешно, но во время выполнения запрашивает только для деталей студента, но не отображает детали, как можно было бы ожидать, когда я вызываю функцию идентификации (). На блоках кода, ошибка не может показать, а на интернет-компиляций, таких как https://www.onlinegdb.com/online_c++_compiler это показывает, что есть ошибка сегментации в коде. Пожалуйста помогите, где это необходимо. Мой код точно (в целом), как показано ниже: #include с помощью патезраса; / ** Базовый класс ** / класс студент {защищен: строка studName, studRegNum; общественности: студент (строка stdName, строка REGNO); / ** Для определения дружественный класс, который является общим для обоих классов ** / друга недействительными идентифицировать (); }; / ** Конструктор класса студент ** / студент :: студент (строка stdName, строка REGNO) {studName = stdName; studRegNum = REGNO; } / ** производного класса ** / класс studentAthlete: общественный студент {частное: строка member_sport; общественности: / ** Чтобы создать конструктор для класса studentAthlete в классе ** / studentAthlete (строка student_sport): студент (studName, studRegNum) {member_sport = student_sport; } / ** Для определения дружественный класс, который является общим для обоих классов ** / друга недействительными идентифицировать (); }; / ** Для отображения информации студент ** / аннулируются идентификации () {studentAthlete са (sa.member_sport); соиЬ студент (строка stdName, строка REGNO) {studName = stdName; studRegNum = REGNO; } / ** производного класса ** / класс studentAthlete: общественный студент {частное: строка member_sport; общественности: / ** Чтобы создать конструктор для класса studentAthlete в классе ** / studentAthlete (строка student_sport): студент (studName, studRegNum) {member_sport = student_sport; } / ** Для определения дружественный класс, который является общим для обоих классов ** / друга недействительными идентифицировать (); }; / ** Для отображения информации студент ** / аннулируются идентификации () {studentAthlete са (sa.member_sport); соиЬ студент (строка stdName, строка REGNO) {studName = stdName; studRegNum = REGNO; } / ** производного класса ** / класс studentAthlete: общественный студент {частное: строка member_sport; общественности: / ** Чтобы создать конструктор для класса studentAthlete в классе ** / studentAthlete (строка student_sport): студент (studName, studRegNum) {member_sport = student_sport; } / ** Для определения дружественный класс, который является общим для обоих классов ** / друга недействительными идентифицировать (); }; / ** Для отображения информации студент ** / аннулируются идентификации () {studentAthlete са (sa.member_sport); соиЬ / ** Чтобы создать конструктор для класса studentAthlete в классе ** / studentAthlete (строка student_sport): студент (studName, studRegNum) {member_sport = student_sport; } / ** Для определения дружественный класс, который является общим для обоих классов ** / друга недействительными идентифицировать (); }; / ** Для отображения информации студент ** / аннулируются идентификации () {studentAthlete са (sa.member_sport); соиЬ / ** Чтобы создать конструктор для класса studentAthlete в классе ** / studentAthlete (строка student_sport): студент (studName, studRegNum) {member_sport = student_sport; } / ** Для определения дружественный класс, который является общим для обоих классов ** / друга недействительными идентифицировать (); }; / ** Для отображения информации студент ** / аннулируются идентификации () {studentAthlete са (sa.member_sport); соиЬ
1

голосов
1

ответ
172

Просмотры

запущенное приложение Objective-C не удалось под Windows,

я не могу больше, развиваюсь, потому что я не смог запустить свое первое приложение с оболочкой, файлы .o были создан, но я не знаю, как запустить их (связывание), связующая команда, я использую: НКУ -o прог - Wno-импорт Student.o main.o -L с: /GNUstep/mingw/lib/gcc/mingw32/4.4.0/include -lobjc я получил знаменитый Id возвращается 1 выездного выход состояния ошибки THX заранее за помощь :)
Malloc
1

голосов
2

ответ
5.8k

Просмотры

Ошибка 438 при использовании процедур VB6

Из того, что я понимаю об ошибке во время выполнения 438, это указывает на бинарные проблемы совместимости, как ссылочного библиотеки ActiveX не совместим с распределенной библиотеки. Я не вижу причин, почему эта ошибка во время выполнения будет создана для основных процедур VB6 как CLng или раунд. Dim X As Integer Dim Y As Single Dim результата, как Long X = GetX () Возвращает 0 Y = GetY () Возвращает 0.75 результат = CLng (X / Y) 'кидает ошибки во время выполнения 438 результат = Round (X / Y)' броски ошибка времени выполнения 438 есть ли что-то очевидно, что я здесь отсутствует? EDIT: Я подтвердил, что проблема заключается в проекте, а не код. Кажется, что эта ошибка / ситуация причуда специфической для среды разработки, предлагаемой General Electric, Proficy Ifix 8.1.
Greg Buehler
1

голосов
1

ответ
5.9k

Просмотры

MS-Access ошибка времени выполнения 2046

Я бегу MS-Access 2000 (не мой выбор - компания использует его). Я заметил, что если у меня есть параметры запуска набор, чтобы открыть форму, когда база данных открыта я получаю ошибку времени выполнения 2046: Команда или действие «Requery» не доступны в данный момент. Я не могу отладить его, хотя, потому что, когда я нажимаю отладки базы данных закрывается, и единственный раз, когда происходит ошибка, когда я закрываю базу данных. Кто-нибудь знает, что вызывает это и то, что я могу сделать, чтобы избавиться от ошибки?
Zack
1

голосов
1

ответ
1.6k

Просмотры

Ошибка при работе решения VS2008; Решение строит штраф

Я получаю диалоговое окно ошибки: "Не удается запустить программу "C: \ Users \ Джеймс \ Desktop \ MyAppSourceCode \ Release \ Myapp.exe" C:. \ Users \ Джеймс \ Desktop \ MyAppSourceCode \ Release" не является допустимым рабочим каталог. "Когда я пытаюсь запустить (F5 или F10) в VS2008 решение (VC ++). Это компилируется без ошибок. Я также попытался очистки всей SOLN и восстановление его. Но до сих пор получаю эту ошибку. В каталоге решения есть папка под названием Release тоже. Я не понимаю, почему я получаю такую ​​ошибку. Я твердо считаю, что это вопрос VS, так как тот же код работает нормально в другой системе. Может кто-нибудь, пожалуйста, помогите мне избавиться от этой ошибки во время выполнения. заранее спасибо ,
codeLover
1

голосов
3

ответ
1.4k

Просмотры

Logger :: деЫпзЬапсе вызывает bad_alloc исключение в log4cplus

Я пытаюсь осуществить регистрацию в C Применение ++ с использованием log4cplus. Я в состоянии успешно строить / ссылку (я добавил log4cplus.lib моей дополнительной LIBS и скопировал log4cplus.dll к сборке / OUTDIR) Когда я запускаю мое приложение, я получаю следующее исключение, когда он выполняет свой Logger :: деЫпзЬапсе вызов: Необработанное исключение при 0x75cad36f в LogTesterConsole.exe: Microsoft C ++ исключения: станд :: bad_alloc в ячейке памяти 0x0013ed8c .. Я попытался поместить вызов вне моей основной () рутины, а также внутри и имею одни и те же результаты. Есть идеи? Код: - #include "stdafx.h" #include #include #include с использованием пространства имен log4cplus; INT _tmain (интермедиат ARGC, _TCHAR * ARGV []) {BasicConfigurator конфигурации; config.configure (); Регистратор Регистратор = Logger :: деЫпзЬапсе (LOG4CPLUS_TEXT ( "основной")); LOG4CPLUS_WARN (регистратор, LOG4CPLUS_TEXT ( "Hello, World!")); возвращать 0; }
Josh
1

голосов
1

ответ
336

Просмотры

FileOpenService бросает NoClassDefFoundError

Код Java, ниже бросает NoClassDefFoundError: FileOpenService FOS = (FileOpenService) ServiceManager.lookup ( "javax.jnlp.FileOpenService"); Как я могу решить эту проблему?
user1697818
1

голосов
1

ответ
806

Просмотры

Node.js ошибка Arduino вход последовательного монитора

Я пытаюсь научиться Node.js в попытке соединиться с рабочим Arduino, например, через последовательный порт. Код выглядит следующим образом: переменная = SerialPort требуется ( «SerialPort»); // включить SerialPort библиотека вар SerialPort = serialport.SerialPort; // локализовать конструктор объекта вар экспресс = требуется ( 'экспресс'), приложение = экспресс (), HTTP = требуется ( 'HTTP'), сервер = http.createServer (приложение), Io = требуется ( 'Socket.io'). слушать (сервер); // прослушивание новых веб-клиентов: server.listen (8080); // открыть последовательный порт. Измените имя на имя вашего порта, так же, как и в обработке и Arduino: вар зр = новый SerialPort ( «/ Dev / ttyACM0», {// искать возврат и новую строку в конце каждого пакета данных: парсер: SerialPort. parsers.readline ( "\ г \ п")}); // реагировать на GET запросов веб-страницы с index.html: app.get ( '/', функция (Req, Рез) {res.sendfile (__ имя_директории + '/index.html');}); // прослушивание новых соединений Socket.io: io.sockets.on ( «соединение», функция (сокет) {// если есть клиентский сокет, прослушивание новых последовательных данных: sp.on ( «данные», функции (данные ) {// устанавливаем свойство значения баллов для последовательной строки: scores.value = данные; // для отладки, вы должны увидеть это в терминале: console.log (данные); // послать событие serialdata на веб-клиент : socket.emit ( 'serialEvent', оценка);});}); Код успешно выполняет следующие выходные: информация - socket.io начала отладки - служил статического контента /socket.io. JS отладка - клиент уполномочил информация - Рукопожатие уполномоченного Yh2i5KCqhagEnCIK41q3 отладки - установка запроса GET /socket.io/1/websocket/Yh2i5KCqhagEnCIK41q3 отладки - установить интервал подтверждения для клиента Yh2i5KCqhagEnCIK41q3 отладки - клиент уполномочил для отладки - WebSocket написания 1 :: Я затем ввести некоторые входную в мой Arduino последовательного монитора и мой сценарий Node.js падает со следующей ошибкой: /home/sisko/NodeJS/nodeSerialServer/serialServer.js:49 scores.value = данные; ^ ReferenceError: оценки не определена SerialPort. (/Home/sisko/NodeJS/nodeSerialServer/serialServer.js:49:3) при SerialPort.EventEmitter.emit (events.js: 93: 17) в parsers.readline (/ главная / Sisko / NodeJS / nodeSerialServer / node_modules / SerialPort /serialport.js:36:17) в Array.forEach (родной) в Object.parsers.
sisko
1

голосов
1

ответ
2.3k

Просмотры

Ключевой путь не найден ошибочный объект, но я могу вставить в хранилище данных

Я получаю эту ошибку: ядро ​​хранилища данных данных отсутствует получает ошибку: «NSInvalidArgumentException», причина: Ключевой путь flowData.flowAmount не найден в сущности, при попытке загрузить данные из основного хранилища данных в Tableview. SQLite база данных в настоящее время воссоздана в следующий раз, когда я запустить приложение после того, как я удалить приложение из Simulator после изменения модели данных и reversioned его. Я могу вставить в базу данных. Этот дамп показывает запись, я только что ввели: INSERT INTO VALUES "ZFLOWDATA" (1,1,1, NULL, 8.0,376884478.384176,376884471.83175,8.0); Однако, когда я пытаюсь читать из хранилища данных я получаю вышеуказанную ошибку. Вот соответствующий код, когда я пытаюсь загрузить данные: - (Недействительными) viewDidLoad {[супер viewDidLoad]; NSError * ошибка; если ([[само fetchedResultsController] performFetch: & ошибка]) {NSLog (@ "Unresolved ошибка% @,% @", ошибка, [ошибка UserInfo]); Выход (-1); // Сбой} self.title = @ "Элементы потока данных"; } И - (NSFetchedResultsController *) fetchedResultsController {jhsAppDelegate * AppDelegate = (jhsAppDelegate *) [[UIApplication sharedApplication] делегат]; managedObjectContext = [AppDelegate managedObjectContext]; если (! fetchedResultsController = ноль) {вернуться fetchedResultsController; } NSFetchRequest * fetchRequest = [[NSFetchRequest Alloc] инициализации]; NSEntityDescription * объект = [NSEntityDescription entityForName: @ inManagedObjectContext "FlowData": managedObjectContext]; [FetchRequest setEntity: сущность]; NSSortDescriptor * рода = [[NSSortDescriptor Alloc] initWithKey: @ "FlowData. сохранить) NSNumber * flowAmount; @property (неатомической, сохраняют) NSDate * flowEnteredDateTime; @property (неатомической, сохраняют) NSDate * flowOccurrenceDateTime; @property (неатомический, сохраняет) NSNumber * flowScheduledFrequencyMinutes; @property (неатомической, сохраняют) NSNumber * flowUrgency; @end Это должно быть что-то о том, как я пытаюсь прочитать в данных, так как я могу вставить строку в другой ViewController, потому что я считаю, что FlowData.flowAmount существует на сущности, как она вставляется в сущности. Есть идеи? Есть ли порядок, в котором атрибуты перечислены в файле .h должен соответствовать порядку в реальной модели данных? Соответствуют ли мои типы данных? сохранить) NSNumber * flowScheduledFrequencyMinutes; @property (неатомической, сохраняют) NSNumber * flowUrgency; @end Это должно быть что-то о том, как я пытаюсь прочитать в данных, так как я могу вставить строку в другой ViewController, потому что я считаю, что FlowData.flowAmount существует на сущности, как она вставляется в сущности. Есть идеи? Есть ли порядок, в котором атрибуты перечислены в файле .h должен соответствовать порядку в реальной модели данных? Соответствуют ли мои типы данных? сохранить) NSNumber * flowScheduledFrequencyMinutes; @property (неатомической, сохраняют) NSNumber * flowUrgency; @end Это должно быть что-то о том, как я пытаюсь прочитать в данных, так как я могу вставить строку в другой ViewController, потому что я считаю, что FlowData.flowAmount существует на сущности, как она вставляется в сущности. Есть идеи? Есть ли порядок, в котором атрибуты перечислены в файле .h должен соответствовать порядку в реальной модели данных? Соответствуют ли мои типы данных? Есть идеи? Есть ли порядок, в котором атрибуты перечислены в файле .h должен соответствовать порядку в реальной модели данных? Соответствуют ли мои типы данных? Есть идеи? Есть ли порядок, в котором атрибуты перечислены в файле .h должен соответствовать порядку в реальной модели данных? Соответствуют ли мои типы данных?
Jazzmine
1

голосов
1

ответ
1.1k

Просмотры

Java msgpack класс с поплавками аварий

У меня есть очень простой класс Java, который представляет 2d вектор. Тем не менее, когда я запускаю код сериализовать его сообщения пакета, он создает ошибку времени выполнения. Сериализация этот класс должен быть действительно основное поведение, и должны работать, не так ли? Я не нашел никого, кто имеет аналогичные проблемы. Код и исключения ниже. Я использую Java 1.7 SDK на окнах 7 в затмении, и я попробовал сообщение пакет 1.6.6 и 1.6.7 от мавена. импорт org.jbox2d.common.Vec2; импорт org.msgpack.annotation.Message; @Message общественного класса SerVec2 {общественного поплавка х, у; общественного SerVec2 (vec2 v) {this.x = ух; this.y = VY; } Общественных vec2 Тов () {вернуть новый vec2 (х, у); }} Пустота someWhereElse (SerVec2 SV) {MessagePack msgpack = новый MessagePack (); байт [] байт = msgpack.write (SV); } Ошибка выполнения: 18 февраля 2013 8:48:49 AM org.msgpack.template.builder.BuildContext построить суровыми: строитель: {если ($ 3 && $ 1.trySkipNil (!)) {Возвращение нуль; } Skylights.util.SerVec2 _ $$ _ т; если ($ 2 == NULL) {_ $$ _ т = новый skylights.util.SerVec2 (); } Еще {_ $$ _ т = (skylights.util.SerVec2) $ 2; } $ 1.readArrayBegin (); _ $$ _ t.x = $ 1.readFloat (); _ $$ _ t.y = $ 1.readFloat (); $ 1.readArrayEnd (); вернуться _ $$ _ т; } Org.msgpack.MessageTypeException: org.msgpack.template.builder.TemplateBuildException: Не удается скомпилировать: {если ($ 3 && $ 1.trySkipNil (!)) {Возвращение нуль; } Skylights.util.SerVec2 _ $$ _ т; если ($ 2 == NULL) {_ $$ _ т = новый skylights.util.SerVec2 (); } Еще {_ $$ _ т = (skylights.util.SerVec2) $ 2; } $ 1.readArrayBegin (); _ $$ _ t.x = $ 1.readFloat (); _ $$ _ t.y = $ 1.readFloat (); $ 1. readArrayEnd (); вернуться _ $$ _ т; } На org.msgpack.template.TemplateRegistry.buildAndRegister (TemplateRegistry.java:516) в org.msgpack.template.TemplateRegistry.lookupAfterBuilding (TemplateRegistry.java:413) в org.msgpack.template.TemplateRegistry.lookup (TemplateRegistry.java: 246) в org.msgpack.template.builder.JavassistTemplateBuilder.toTemplate (JavassistTemplateBuilder.java:128) в org.msgpack.template.builder.JavassistTemplateBuilder.buildTemplate (JavassistTemplateBuilder.java:116) в org.msgpack.template.builder.AbstractTemplateBuilder .buildTemplate (AbstractTemplateBuilder.java:61) при org.msgpack.template.TemplateRegistry.buildAndRegister (TemplateRegistry.java:503) при org.msgpack.template.TemplateRegistry.lookupAfterBuilding (TemplateRegistry.java:413) при org.msgpack. {Если (! $ 3 && $ 1.trySkipNil ()) {возвращение нуль; } Skylights.util.SerVec2 _ $$ _ т; если ($ 2 == NULL) {_ $$ _ т = новый skylights.util.SerVec2 (); } Еще {_ $$ _ т = (skylights.util.SerVec2) $ 2; } $ 1.readArrayBegin (); _ $$ _ t.x = $ 1.readFloat (); _ $$ _ t.y = $ 1.readFloat (); $ 1.readArrayEnd (); вернуться _ $$ _ т; } На org.msgpack.template.builder.BuildContext.build (BuildContext.java:73) в org.msgpack.template.builder.DefaultBuildContext.buildTemplate (DefaultBuildContext.java:56) в org.msgpack.template.builder.JavassistTemplateBuilder. buildTemplate (JavassistTemplateBuilder.java:118) в org.msgpack.template.builder.AbstractTemplateBuilder.buildTemplate (AbstractTemplateBuilder.java:61) в org.msgpack.template.TemplateRegistry.buildAndRegister (TemplateRegistry.java:503) ...
Dick Kruithof
1

голосов
1

ответ
11.6k

Просмотры

VC ++ время выполнения, чтобы прекратить его необычным способом

Мой Неуправляемый VC ++ MFC (Нет .NET используется, никакой поддержки CLR, использование MFC в разделяемой DLL) приложение не пытается развернуть с помощью Visual C ++ файлов во время выполнения, как частных собраний. Он правильно работает на окнах 7 свежие установлены компьютерные. Но дает «Это приложение просил Runtime прекратить его необычным способом. Пожалуйста, обратитесь в службу поддержки приложения для получения дополнительной информации.»Ошибка в свежем установленном Wondows XP sp3 компьютера. Я проверил в журнале событий приложений. Но там же нет больше деталей, как раз показывает ту же ошибку. Потом я прочитал эти темы и прибой вокруг интернета. Тема - 1 тема - 2 статьи -1 Но не мог найти ключ решения или неприятности съемки метод. так вот завожусь помощь.
Nayana Adassuriya
1

голосов
1

ответ
393

Просмотры

Общие ошибки Синтаксических

В 4D приложения, у меня есть следующие строки кода: Begin SQL UPDATE Ключи SET DESC =: $ DESC, KeyStamp =: $ key_stamp WHERE KeyTitle =: $ key_title End SQL При попытке запуска кода, отображается следующее сообщение об ошибке: Общая ошибка синтаксического анализа. Удалось выполнить синтаксический анализ или вокруг следующего интервала подстроки - (16, 23) - ... SET DESC = ... Кто-нибудь увидеть проблему с кодом? Клавиши не является ключевым словом или что-нибудь, не так ли?
Noctis Skytower
1

голосов
1

ответ
61

Просмотры

ошибка с нулевым указателем

более 11 и это мой Java-файл, который не может быть запущен на импорт android.app.Activity; импорт android.content.ActivityNotFoundException; импорт android.content.Intent; импорт android.os.Bundle; импорт android.view.View; импорт android.widget.AdapterView; импорт android.widget.AdapterView.OnItemClickListener; импорт android.widget.ArrayAdapter; импорт android.widget.ListView; общественный класс maincontentview расширяет активность {общественные недействительный OnCreate (Пачка savedInstanceState) {// TODO автоматической генерации метод заглушка super.onCreate (savedInstanceState); Строка [] contentarray = GetResources () getStringArray (R.array.contnarr). this.setListAdapter (новый ArrayAdapter (это, R.layout.maincontentview, R.id.label1, contentarray)); ListView LV = getListView (); // прослушивание одного элемента списка на клик левов. setOnItemClickListener (новый OnItemClickListener () {общественного недействительный onItemClick (AdapterView родитель, Вид вид, внутр позиция, длинный идентификатор) {// запускают различные действия переключения (положение) {случай 0: Намерение TXT = новый Intent (view.getContext (), TextA .class), попробуйте {startActivity (TXT);} поймать (ActivityNotFoundException е) {e.printStackTrace ();} перерыв; случай 1: Намерение видео = новый Intent (view.getContext (), Videos.class), попробуйте {startActivity (видео);} поймать (ActivityNotFoundException е) {e.printStackTrace ();} перерыв; по умолчанию: разрыв;}}}); } Частный ListView getListView () {// TODO Auto-генерироваться метод заглушки возврата нуль;
user1794499
1

голосов
1

ответ
326

Просмотры

VB 6 Ошибки при выполнении хранимой процедуры

У меня есть программа VB 6 что вызовы хранимой процедуры, проживающих в базе данных MYSQL. Когда я попытался проверить это один в двух разных компьютерах, она работает в COMPUTER1 но есть ошибка в COMPUTER2. Эти компьютеры имеют: те же PHP и MySQL версии (XAMPP) одинаковые ODBC 3.51 одни и те же хранимые процедуры и тот же код оба окна 7 32-битных ОС Это ошибка: Ошибка выполнения -2147217900 (80040E14) [MySQL] [ODBC Driver 3.51] [туздЫ 5.1.41] у вас есть ошибка в вашем SQL синтаксиса; проверьте руководство, которое соответствует версии сервера MySQL для правильного синтаксиса, чтобы использовать «{Вызывает Selectproducts}» в строке 1 «selectproducts» есть имя моей хранимой процедуры. Я искал это на Google, но ничего не имеет то же самое с этой ошибкой. Можете ли вы помочь мне с этим? Я действительно не знаю, что это проблема моего COMPUTER2. ИП Код: ПРОЦЕДУРА DROP `selectproducts` // CREATE DEFINER =` root` @ `` localhost` ПРОЦЕДУРА selectproducts` () начинают выбрать * из продуктов; конец
Handy Manny
1

голосов
1

ответ
197

Просмотры

Получение исключения, и я не знаю, почему

импорт java.util.Scanner; // Импорт необходимых классов импорта java.text.DecimalFormat; импорт java.io.File; импорт java.io.IOException; импорт java.io.PrintWriter; импорт java.io.FileWriter; импорт java.io.FileNotFoundException; общественного класса Lab11 {государственной статической силы основных (String [] арг) {Сканер сканирования = новый сканер (System.in); DecimalFormat FMT = новый DecimalFormat ( "0,00"); Окончательный INT ПРЕДЕЛ = 1000, MAX = 10, MIN = -10; // количество Интс для чтения в файл Струнный FileName; // имеет имя файла System.out.print ( «Введите имя файла для хранения целых чисел:»); имя_файла = scan.next (); PrintWriter Outfile = NULL; // создает PrintWriter для записи указанного файла попробовать {Outfile = новый PrintWriter (новый файл (Filename)); // TryCatch заявление, чтобы поймать любые ошибки при открытии файла} поймать (FileNotFoundException е) {System.out.println ( «Файл„+ имя_файл +“не существует Выход программы.»); System.exit (-1); } Для (INT I = 0; я 0) поз ++; // проверяет, если положительный и прибавляет к общему поз, если (число <0) отр ++; // проверяет, является отрицательным и прибавляют к общим негам еще нулевой ++; // проверяет нули и добавляет один тотально} ср = (ср / LIMIT); // вычисляет фактическую среднюю inFile.close (); // закрывает файл для ввода} Outfile = NULL; // Открытие файла для вывода снова попробовать {Outfile = новый PrintWriter (новый FileWriter (имя_файл, правда)); // TryCatch заявление, чтобы поймать любые ошибки при открытии файла} // Позволяет файл, который будет добавлен к вместо усеченного улова (IOException е) {System.out.println ( «Файл„+ имя_файл +“не существует. Выход из программы») ; System.exit (-1); } System.out.println ( "\ п \ nNumber отрицательных чисел в файле:" + отр); System.out.println ( "\ nNumber положительных чисел в файле:" + Pos); System.out.println ( «\ nNumber нулей в файле:» + Ноль); System.out.println ( "\ nAverage чисел в файле:" + fmt.format (ср)); outFile.print ( «Количество отрицательных чисел в файле:» + отр); outFile.print ( «Количество положительных чисел в файле:» + Pos); outFile.print ( «Нули в файле:» + ноль); outFile.print ( "Среднее значение чисел в файле:" + fmt.format (ср)); outFile.close (); } // Конец основной} Я беру интро к Java, и я просто зверский на него. Независимо от того, сколько часов я занимаюсь или учебы, я просто не понимаю. Я получил это много сделано, но теперь я получаю это. Исключение в потоке «основного» java.util.NoSuchElementException: Нет линии найдено в java.util.Scanner.nextLine (Scanner.java:1585) в Lab11.main (Lab11.java: 89) Я понятия не имею, где я пошло не так. Любое руководство было бы здорово. Благодарю.
user2264073
1

голосов
1

ответ
352

Просмотры

Как связаны в на startActivity () требует FLAG_ACTIVITY_NEW_TASK?

инструмент сообщения об ошибке Android, говорит мне, что у меня есть 60 различных аварий из 60 различных мест под ошибкой: «Fatal Exception android.util.AndroidRuntimeException Вызов startActivity () из-за пределы контекста деятельности требует флаг FLAG_ACTIVITY_NEW_TASK ли это на самом деле то, что вы хотите.? " Кроме того, я отправлять сообщения обратно в Основной вид деятельности таким образом от службы: общественный статический класс ClickHandler расширяет Обработчик {личное окончательное WeakReference wMain; общественного ClickHandler (Основной основной) {супер (); this.wMain = новый WeakReference (основной); } @Override общественного недействительными handleMessage (сообщ Message) {Я лично никогда не воспроизводится этот сбой. У меня есть 3 услуги, которые выполняются, но ни один из них не называют «startActivity». Эти 3 услуги делают отправки сообщений обратно в основной деятельности, и можно предположить, что службы работают в то время как основная деятельность в фоновом режиме. Как я могу начать связан в о причине этих многочисленных дорожно-транспортных происшествий?
hunterp
1

голосов
1

ответ
925

Просмотры

Glibc обнаружено; повреждение памяти

Так что это очень странно .. Я использую галогенид (https://github.com/halide/Halide/), но ошибка, я получаю C ++ связаны. Когда я запускаю код я получаю *** Glibc обнаружен *** ./lesson_04: таНос (): повреждение памяти: 0x0000000000a36640 *** Она также печатает «понимая», но не печатает «размыть начальное». Она работает, когда я прохожу сигмы, равный 1,0, но не работает на 2.0 или 3.0. Это часть более длинного кода. Чем больше код не работает даже на 1. Я не понимаю, как значение может повлиять на что-либо и где он застревает. Любая помощь? Благодаря #include #include #include #include "броненосец" с использованием пространства имен ARMA; с использованием пространства имен галогенида; # include "../apps/support/image_io.h" Изображение calculateGaussian (двойной sigmaD) {INT сигма = (целое) sigmaD; Свертка изображения (сигма * 6 + 1, сигма * 6 + 1); Поплавок сумма = 0; для (INT I = -sigma * 3; я
Andrei Ivanov
1

голосов
1

ответ
2.8k

Просмотры

SQL Loader отсутствует ошибка запятой

UPDATE: Моя проблема была решена, просто хотел, чтобы добавить этот полезный кусок кода я наткнулся. Это поможет вам сделать .ctl файл гораздо проще. Надеюсь, это полезным для некоторых людей там. выберите 'LOAD DATA APPEND INTO TABLE' || '& TABLE_NAME' || 'ПЛОЩАДКА TERMINATED BY "~" Продольный NULLCOLS (' "Column Name",» ' "sql_loader_type" от двойного союза все выберите COLUMN_NAME, DECODE (DATA_TYPE, 'TIMESTAMP (6)',' TIMESTAMP«YYYY-MM-DD HH24: MI : SS.FF», ' 'NUMBER',' DECIMAL ВНЕШНЕЕ, ' 'VARCHAR2',' CHAR ' 'CHAR',' CHAR», 'DATE', '"TO_DATE (SUBSTR (:' || column_name ||», 1,19), '' ГГГГ-ММ-ДД HH24: MI: SS '')», ') "sql_loader_type" от all_tab_cols, где владелец = ВЕРХНИЙ (' & SCHEMA_NAME ') И TABLE_NAME = ВЕРХНИЙ (' & TABLE_NAME ') объединение всех выберите ')' "Колонка Name", '' "sql_loader_type" от двойного; Я пытаюсь играть с SQL Loader, чтобы лучше понять его и до сих пор его было очень интересно. Моя главная проблема прямо сейчас, хотя в том, что даже если он говорит, что 42 строк были поручены, мой стол еще пуст. ** Просто FYI, я использую таблицу Excel сохранить в формате .csv. Причина я практикую с файлом первенствовать, потому что рано или поздно я буду автоматизировать этот процесс для проекта. ** Дальнейшее рассмотрение файла журнала показывает, что я получаю ошибку о том, что мне не хватает колонки. Вот как мой файл CTL установлен: опции (пропуск = 11, ошибки = 10, строки = 45) DATA входной_файл нагрузки «расположение моего файла» Отклонено - Ошибка на столе T_LEGAL_TRANSACTIONS, колонки org_ID. ORA-00917: отсутствует запятая запись 6: Отклонено - ошибка таблицы T_LEGAL_TRANSACTIONS, колонки org_ID. ORA-00917: отсутствует запятая Запись 7: Отклонено - ошибка таблицы T_LEGAL_TRANSACTIONS, колонки org_ID. ORA-00917: отсутствует запятая Запись 8: Отклонено - ошибка таблицы T_LEGAL_TRANSACTIONS, колонки org_ID. ORA-00917: отсутствует запятая Запись 9: Отклонено - ошибка таблицы T_LEGAL_TRANSACTIONS, колонки org_ID. ORA-00917: отсутствует запятая записи 10: Отклонено - Ошибка на стол T_LEGAL_TRANSACTIONS, колонки org_ID. ORA-00917: отсутствует запятая Теперь я обыскивал интернет, пытаясь найти то, что может быть причиной этой ошибки, но я придумывая ничего. Может кто-нибудь здесь мне точку в правильном направлении? Также на стороне вопрос, можно ли форматировать журнал поэтому его не страшно смотреть?
user2405778

Просмотр дополнительных вопросов